{"text_format":"1","workbook":"xlsx","n_sheets":11,"sheets":["Instructions","Final financial statement","Costs Incurred&2nd Prefinancing","1. Staff costs","2-3. Travel Costs&Costs of Stay","4. Equipment Costs","5. Subcontracting Costs","Co-financing","Breakdown & Project Funding","Breakdown Staff & Travel Costs","Rates"],"not_rendered":{"charts":0,"images":2,"macros":1,"external_links":0,"defined_names":47,"comments":0,"pivot_tables":0},"unopened":[],"bounds":{"document_bytes":16777216,"sheet_cells":100000,"rows_first":2000,"rows_last":500,"rows_between":2000,"halvings":0,"cell_chars":16384,"cell_head_chars":4096},"cells_cut":0,"cells_raw":0,"read":"whole","date_system":"1900"}

{"sheet":"Instructions","index":0,"n_rows":136,"n_cols":3,"rows_kept":136,"cut":false,"hidden":false,"merged":[[117,1,117,3],[132,1,132,3],[1,1,1,3],[15,1,15,3],[46,1,46,3],[65,1,65,3],[81,1,81,3],[102,1,102,3],[61,1,61,3]]}
[]
[null,"GENERAL INSTRUCTIONS - CBHE 2016 - ANNEX VI - FINANCIAL STATEMENTS"]
[]
[null,null,"When opening the file and in order to make it work properly:"]
[]
[null,null,"- Save the file on your desktop and save it as an \"Excel Macro-Enableb Wordkbook\" file."]
[null,null,"- Please click \"enable content\" if requested by your system."]
[null,null,"- Please click \"activate the macros\" if requested by your system."]
{"$rows_left_out":129}
{"sheet":"Final financial statement","index":1,"n_rows":97,"n_cols":11,"rows_kept":97,"cut":false,"hidden":false,"merged":[[17,1,17,2],[91,3,93,11],[8,8,8,9],[85,6,85,10],[39,10,39,11],[24,10,24,11],[25,10,25,11],[26,10,26,11],[27,10,27,11],[28,10,28,11],[29,10,29,11],[30,10,30,11],[31,10,31,11],[32,10,32,11],[40,10,40,11],[34,10,34,11],[35,10,35,11],[36,10,36,11],[37,10,37,11],[38,10,38,11],[76,10,76,11],[83,1,83,11],[79,1,79,3],[79,10,79,11],[79,8,79,9],[79,6,79,7],[79,4,79,5],[81,1,81,3],[80,1,80,3],[81,10,81,11],[81,8,81,9],[81,6,81,7],[81,4,81,5],[80,10,80,11],[80,8,80,9],[80,6,80,7],[80,4,80,5],[6,1,6,11],[71,10,71,11],[72,10,72,11],[73,10,73,11],[74,10,74,11],[75,10,75,11],[66,10,66,11],[67,10,67,11],[68,10,68,11],[69,10,69,11],[70,10,70,11],[61,10,61,11],[62,10,62,11],[63,10,63,11],[64,10,64,11],[12,4,12,5],[11,4,11,5],[33,10,33,11],[21,10,21,11],[20,1,20,11],[22,10,22,11],[23,10,23,11],[13,1,13,2],[12,1,12,2],[65,10,65,11],[56,10,56,11],[57,10,57,11],[58,10,58,11],[59,10,59,11],[60,10,60,11],[51,10,51,11],[52,10,52,11],[53,10,53,11],[54,10,54,11],[55,10,55,11],[47,10,47,11],[48,10,48,11],[49,10,49,11],[50,10,50,11],[41,10,41,11],[42,10,42,11],[43,10,43,11],[44,10,44,11],[45,10,45,11],[77,1,77,9],[77,10,77,11],[96,1,96,11],[91,2,93,2],[89,2,89,4],[8,10,8,11],[8,3,8,5],[10,1,10,2],[15,4,15,5],[14,4,14,5],[13,4,13,5],[18,4,18,5],[18,1,18,2],[17,4,17,5],[8,1,8,2],[16,1,16,2],[16,4,16,5],[11,1,11,2],[15,1,15,2],[14,1,14,2],[10,4,10,5],[87,2,87,3],[85,2,85,3],[46,10,46,11]]}
[]
[]
[null,null,null,"Key Action 2: Cooperation for innovation and the exchange of good practices"]
[null,null,null,"Capacity Building in the field of higher education"]
[]
[]
[null,"ANNEX VI - FINAL FINANCIAL STATEMENT"]
[]
{"$rows_left_out":90}
{"sheet":"Costs Incurred&2nd Prefinancing","index":2,"n_rows":95,"n_cols":11,"rows_kept":95,"cut":false,"hidden":false,"merged":[[16,4,16,5],[17,4,17,5],[24,10,24,11],[25,10,25,11],[26,10,26,11],[27,10,27,11],[28,10,28,11],[29,10,29,11],[18,1,18,2],[18,4,18,5],[20,1,20,11],[21,10,21,11],[22,10,22,11],[23,10,23,11],[17,1,17,2],[6,1,6,11],[8,1,8,2],[8,3,8,5],[8,10,8,11],[10,1,10,2],[10,4,10,5],[8,8,8,9],[15,1,15,2],[15,4,15,5],[13,1,13,2],[13,4,13,5],[14,1,14,2],[14,4,14,5],[11,8,12,9],[11,10,12,11],[13,8,14,9],[13,10,14,11],[15,8,16,9],[15,10,16,11],[11,1,11,2],[11,4,11,5],[12,1,12,2],[12,4,12,5],[16,1,16,2],[36,10,36,11],[37,10,37,11],[38,10,38,11],[39,10,39,11],[17,8,18,9],[17,10,18,11],[40,10,40,11],[41,10,41,11],[30,10,30,11],[31,10,31,11],[32,10,32,11],[33,10,33,11],[34,10,34,11],[35,10,35,11],[48,10,48,11],[49,10,49,11],[50,10,50,11],[51,10,51,11],[52,10,52,11],[53,10,53,11],[42,10,42,11],[43,10,43,11],[44,10,44,11],[45,10,45,11],[46,10,46,11],[47,10,47,11],[60,10,60,11],[61,10,61,11],[62,10,62,11],[63,10,63,11],[64,10,64,11],[65,10,65,11],[54,10,54,11],[55,10,55,11],[56,10,56,11],[57,10,57,11],[58,10,58,11],[59,10,59,11],[75,10,75,11],[76,10,76,11],[79,1,79,3],[79,4,79,5],[79,6,79,7],[79,8,79,9],[79,10,79,11],[66,10,66,11],[67,10,67,11],[68,10,68,11],[69,10,69,11],[70,10,70,11],[71,10,71,11],[72,10,72,11],[73,10,73,11],[74,10,74,11],[77,1,77,9],[77,10,77,11],[94,1,94,11],[89,2,91,2],[85,2,85,3],[80,1,80,3],[80,4,80,5],[80,6,80,7],[80,8,80,9],[80,10,80,11],[81,1,81,3],[81,4,81,5],[81,6,81,7],[81,8,81,9],[81,10,81,11],[87,2,87,4],[85,6,85,10],[83,1,83,11],[89,3,91,11]]}
[]
[]
[null,null,null,"Key Action 2: Cooperation for innovation and the exchange of good practices"]
[null,null,null,"Capacity Building in the field of higher education"]
[]
[]
[null,"ANNEX VI - STATEMENT ON THE USE OF THE PREVIOUS PRE-FINANCING INSTALMENT AND REQUEST FOR PAYMENT (SECOND PRE-FINANCING)"]
[]
{"$rows_left_out":88}
{"sheet":"1. Staff costs","index":3,"n_rows":9,"n_cols":16,"rows_kept":9,"cut":false,"hidden":false,"merged":[[1,1,1,14],[3,1,4,2],[3,3,4,3],[3,4,4,4]]}
[]
[null,"1. Staff Costs"]
[]
[null,"Total (EUR)",null,{"$f":"SUMIF(O:O,\"<>Error\",N:N)","v":0},{"$f":"IF(D4>ROUND('Final financial statement'!D12*1.1,2),\"Exceeds Grant Awarded + 10%\",\"\")","v":""}]
[]
[]
[null,"Work\nPackage","Partner \nN°","Name of Partner\n(to encode in the final financial statement sheet)","Country\n(to encode in the final financial statement sheet)","Supporting Document Ref.","Name of Staff Member","Staff category","Short description of tasks","From\n(dd/mm/yy)","To\n(dd/mm/yy)","Number of \ndays\n(A)","Maximum \nUnit cost per day \n(in EUR)\n(B)","Total Calculated\n(in EUR)\n(A x B)","Check\nData\nEncoding"]
[null,null,null,{"$f":"IFERROR(IF(VLOOKUP(C8,PartnerN°Ref,2,FALSE)=0,\"\",VLOOKUP(C8,PartnerN°Ref,2,FALSE)),\"\")","v":""},{"$f":"IFERROR(IF(VLOOKUP(C8,PartnerN°Ref,3,FALSE)=0,\"\",VLOOKUP(C8,PartnerN°Ref,3,FALSE)),\"\")","v":""},null,null,null,null,null,null,0,{"$f":"IF(O8=\"Error\",0,IFERROR(INDEX(Rates,MATCH(E8,CountryALL,0),MATCH(H8,Category,0)),0))","v":0},{"$f":"IF(O8=\"Error\",0,IF(L8>((K8-J8)+1),((K8-J8)+1)*M8,L8*M8))","v":0},{"$f":"IF(OR(COUNTBLANK(B8:L8)>0,COUNTIF(WorkPackage,B8)=0,COUNTIF(PartnerN°,C8)=0,COUNTIF(CountryALL,E8)=0,COUNTIF(StaffCat,H8)=0,(K8-J8)<0,ISNUMBER(L8)=FALSE,IF(ISNUMBER(L8)=TRUE,L8=INT(L8*1)/1=FALSE)),\"Error\",\"\")","v":"Error"},{"$f":"IF(L8>(K8-J8)+1,(K8-J8)+1,L8)","v":0}]
{"$rows_left_out":2}
{"sheet":"2-3. Travel Costs&Costs of Stay","index":4,"n_rows":9,"n_cols":18,"rows_kept":9,"cut":false,"hidden":false,"merged":[[1,1,1,17],[3,1,3,2],[4,1,4,2]]}
[]
[null,"2-3. Travel Costs & Costs of Stay"]
[]
[null,"Total Travel Costs (in EUR)",null,{"$f":"SUMIF(R:R,\"<>Error\",O:O)","v":0},{"$f":"IF(D4>ROUND('Final financial statement'!D13*1.1,2),\"Exceeds Grant Awarded + 10%\",\"\")","v":""}]
[null,"Total Costs of Stay (in EUR)",null,{"$f":"SUMIF(R:R,\"<>Error\",P:P)","v":0},{"$f":"IF(D5>ROUND('Final financial statement'!D14*1.1,2),\"Exceeds Grant Awarded + 10%\",\"\")","v":""}]
[]
[null,"Work\nPackage","Partner \nN°","Name of Partner\n(to encode in the final financial statement sheet)","Country\n(to encode in the final financial statement sheet)","Supporting \nDocument Ref.","Name of the Person travelling","Student/\nStaff","City and Country of \nDeparture","City and Country of \nDestination","Departure Date\n(dd/mm/yy)","Return Date\n(dd/mm/yy)","Number \nof days for Costs of Stay","Travel \nDistance \n(In KM)","Maximum Travel \nCosts calculated\n(EUR)","Maximum Costs of\nStay calculated\n(EUR)","Total \ncalculated\n(EUR)","Check\nData\nEncoding"]
[null,null,null,{"$f":"IFERROR(IF(VLOOKUP(C8,PartnerN°Ref,2,FALSE)=0,\"\",VLOOKUP(C8,PartnerN°Ref,2,FALSE)),\"\")","v":""},{"$f":"IFERROR(IF(VLOOKUP(C8,PartnerN°Ref,3,FALSE)=0,\"\",VLOOKUP(C8,PartnerN°Ref,3,FALSE)),\"\")","v":""},null,null,null,null,null,null,null,0,0,{"$f":"IF(R8=\"Error\",0,IF(AND(N8>99,N8<500),180,0)+IF(AND(N8>499,N8<2000),275,0)+IF(AND(N8>1999,N8<3000),360,0)+IF(AND(N8>2999,N8<4000),530,0)+IF(AND(N8>3999,N8<8000),820,0)+IF(N8>7999,1100,0))","v":0},{"$f":"IF(R8=\"Error\",0,IF(M8>((L8-K8)+1),IF(AND(H8=\"Staff\",((L8-K8)+1)>0,((L8-K8)+1)<15),(120*((L8-K8)+1)),IF(AND(H8=\"Staff\",((L8-K8)+1)>14,((L8-K8)+1)<61),(1680+((((L8-K8)+1)-14)*70)),IF(AND(H8=\"Staff\",((L8-K8)+1)>60,((L8-K8)+1)<91),(4900+((((L8-K8)+1)-60)*50)),IF(AND(H8=\"Staff\",((L8-K8)+1)>90),6400,IF(AND(H8=\"Student\",((L8-K8)+1)>0,((L8-K8)+1)<15),(55*((L8-K8)+1)),IF(AND(H8=\"Student\",((L8-K8)+1)>14,((L8-K8)+1)<91),(770+((((L8-K8)+1)-14)*40)),IF(AND(H8=\"Student\",((L8-K8)+1)>90),3810,0))))))),IF(AND(H8=\"Staff\",M8>0,M8<15),(120*M8),IF(AND(H8=\"Staff\",M8>14,M8<61),(1680+((M8-14)*70)),IF(AND(H8=\"Staff\",M8>60,M8<91),(4900+((M8-60)*50)),IF(AND(H8=\"Staff\",M8>90),6400,IF(AND(H8=\"Student\",M8>0,M8<15),(55*M8),IF(AND(H8=\"Student\",M8>14,M8<91),(770+((M8-14)*40)),IF(AND(H8=\"Student\",M8>90),3810,0)))))))))","v":0},{"$f":"O8+P8","v":0},{"$f":"IF(OR(COUNTBLANK(B8:N8)>0,COUNTIF(WorkPackage,B8)=0,COUNTIF(PartnerN°,C8)=0,COUNTIF(CountryALL,E8)=0,COUNTIF(Category2,H8)=0,(L8-K8)<0,ISNUMBER(M8)=FALSE,IF(ISNUMBER(M8)=TRUE,M8=INT(M8*1)/1=FALSE),ISNUMBER(N8)=FALSE,IF(ISNUMBER(N8)=TRUE,N8=INT(N8*1)/1=FALSE)),\"Error\",\"\")","v":"Error"}]
{"$rows_left_out":2}
{"sheet":"4. Equipment Costs","index":5,"n_rows":9,"n_cols":15,"rows_kept":9,"cut":false,"hidden":false,"merged":[[1,1,1,14],[3,1,4,2],[3,3,4,3],[3,4,4,4]]}
[]
[null,"4. Equipment Costs"]
[]
[null,"Total (EUR)",null,{"$f":"SUMIF(O:O,\"<>Error\",N:N)","v":0},{"$f":"IF(D4>ROUND('Final financial statement'!D15*1.1,2),\"Exceeds Grant Awarded + 10%\",\"\")","v":""}]
[]
[]
[null,"Work\nPackage","Partner \nN°","Name of Partner \nbenefitting from the equipment\n(to encode in the final financial statement sheet)","Country\n(to encode in the final financial statement sheet)","Supporting Document Ref.","Invoice Date\n(dd/mm/yy)","Nature, type and specifications of the item","Providing company","VAT and Taxes charged to the project?","Amount indicated on the invoice ","Currency indicated on the invoice","Exchange \nRate Used","Amount charged to the project \n(in EUR)","Check\nData\nEncoding"]
[null,null,null,{"$f":"IFERROR(IF(VLOOKUP(C8,PartnerN°Ref,2,FALSE)=0,\"\",VLOOKUP(C8,PartnerN°Ref,2,FALSE)),\"\")","v":""},{"$f":"IFERROR(IF(VLOOKUP(C8,PartnerN°Ref,3,FALSE)=0,\"\",VLOOKUP(C8,PartnerN°Ref,3,FALSE)),\"\")","v":""},null,null,null,null,null,null,null,{"$f":"IFERROR(ROUND(K8/N8,5),\"\")","v":""},0,{"$f":"IF(OR(COUNTBLANK(B8:N8)>0,COUNTIF(WorkPackage,B8)=0,COUNTIF(PartnerN°,C8)=0,COUNTIF(CountryEligEquip,E8)=0,COUNTIF(VATTAXES,J8)=0,ISNUMBER(N8)=FALSE,IF(ISNUMBER(N8)=TRUE,N8=INT(N8*100)/100=FALSE)),\"Error\",\"\")","v":"Error"}]
{"$rows_left_out":2}
{"sheet":"5. Subcontracting Costs","index":6,"n_rows":9,"n_cols":15,"rows_kept":9,"cut":false,"hidden":false,"merged":[[1,1,1,14],[3,1,4,2],[3,3,4,3],[3,4,4,4]]}
[]
[null,"5. Subcontracting Costs"]
[]
[null,"Total (EUR)",null,{"$f":"SUMIF(O:O,\"<>Error\",N:N)","v":0},{"$f":"IF(D4>ROUND('Final financial statement'!D16*1.1,2),\"Exceeds Grant Awarded + 10%\",\"\")","v":""}]
[]
[]
[null,"Work\nPackage","Partner \nN°","Name of Partner \nwho paid for the subcontracting\n(to encode in the final financial statement sheet)","Country\n(to encode in the final financial statement sheet)","Supporting Document Ref.","Invoice Date\n(dd/mm/yy)","Nature, type and specifications of the item","Providing company","VAT and Taxes charged to the project?","Amount indicated on the invoice ","Currency indicated on the invoice","Exchange \nRate Used","Amount charged to the project \n(in EUR)","Check\nData\nEncoding"]
[null,null,null,{"$f":"IFERROR(IF(VLOOKUP(C8,PartnerN°Ref,2,FALSE)=0,\"\",VLOOKUP(C8,PartnerN°Ref,2,FALSE)),\"\")","v":""},{"$f":"IFERROR(IF(VLOOKUP(C8,PartnerN°Ref,3,FALSE)=0,\"\",VLOOKUP(C8,PartnerN°Ref,3,FALSE)),\"\")","v":""},null,null,null,null,null,null,null,{"$f":"IFERROR(ROUND(K8/N8,5),\"\")","v":""},0,{"$f":"IF(OR(COUNTBLANK(B8:N8)>0,COUNTIF(WorkPackage,B8)=0,COUNTIF(PartnerN°,C8)=0,COUNTIF(CountryALL,E8)=0,COUNTIF(VATTAXES,J8)=0,ISNUMBER(N8)=FALSE,IF(ISNUMBER(N8)=TRUE,N8=INT(N8*100)/100=FALSE)),\"Error\",\"\")","v":"Error"}]
{"$rows_left_out":2}
{"sheet":"Co-financing","index":7,"n_rows":13,"n_cols":9,"rows_kept":13,"cut":false,"hidden":false,"merged":[[1,1,1,8],[3,1,4,1],[3,2,4,2],[3,3,4,3]]}
[]
[null,"Co-financing (for information only)"]
[]
[null,"Total (EUR)",{"$f":"SUMIF(I:I,\"<>Error\",H:H)","v":0}]
[]
[]
[null,"Partner N°","Name of Partner\n(to encode in the final financial statement sheet)","Country\n(to encode in the final financial statement sheet)","Budget Heading*","Source of Co-financing**","Nature, type and specifications of the item***","Amount\n(in EUR)","Check\nData\nEncoding"]
[null,null,{"$f":"IFERROR(IF(VLOOKUP(B8,PartnerN°Ref,2,FALSE)=0,\"\",VLOOKUP(B8,PartnerN°Ref,2,FALSE)),\"\")","v":""},{"$f":"IFERROR(IF(VLOOKUP(B8,PartnerN°Ref,3,FALSE)=0,\"\",VLOOKUP(B8,PartnerN°Ref,3,FALSE)),\"\")","v":""},null,null,null,0,{"$f":"IF(OR(COUNTBLANK(B8:H8)>0,COUNTIF(PartnerN°,B8)=0,COUNTIF(BudgetHeadings,E8)=0,ISNUMBER(H8)=FALSE,IF(ISNUMBER(H8)=TRUE,H8=INT(H8*100)/100=FALSE)),\"Error\",\"\")","v":"Error"}]
{"$rows_left_out":6}
{"sheet":"Breakdown & Project Funding","index":8,"n_rows":81,"n_cols":9,"rows_kept":81,"cut":false,"hidden":false,"merged":[[1,1,1,8],[13,1,13,8],[4,7,8,7],[22,1,22,8],[25,7,79,7]]}
[]
[null,"Budget Breakdown by Workpackage / Budget Headings"]
[]
[null,"Work\nPackage","1. Staff \nCosts","2. Travel \nCosts","3. Costs \nof Stay","4. Equipment\nCosts","5. Subcontracting\nCosts","B. Special \nMobility Strand","Total\n(EUR)"]
[null,{"$f":"Rates!J3","v":"Preparation"},{"$f":"SUMIFS('1. Staff costs'!N:N,'1. Staff costs'!B:B,B5,'1. Staff costs'!O:O,\"<>Error\")","v":0},{"$f":"SUMIFS('2-3. Travel Costs&Costs of Stay'!O:O,'2-3. Travel Costs&Costs of Stay'!B:B,B5,'2-3. Travel Costs&Costs of Stay'!R:R,\"<>Error\")","v":0},{"$f":"SUMIFS('2-3. Travel Costs&Costs of Stay'!P:P,'2-3. Travel Costs&Costs of Stay'!B:B,B5,'2-3. Travel Costs&Costs of Stay'!R:R,\"<>Error\")","v":0},{"$f":"SUMIFS('4. Equipment Costs'!N:N,'4. Equipment Costs'!B:B,B5,'4. Equipment Costs'!O:O,\"<>Error\")","v":0},{"$f":"SUMIFS('5. Subcontracting Costs'!N:N,'5. Subcontracting Costs'!B:B,B5,'5. Subcontracting Costs'!O:O,\"<>Error\")","v":0},null,{"$f":"SUM(C5:G5)","v":0}]
[null,{"$f":"Rates!J4","v":"Development"},{"$f":"SUMIFS('1. Staff costs'!N:N,'1. Staff costs'!B:B,B6,'1. Staff costs'!O:O,\"<>Error\")","v":0},{"$f":"SUMIFS('2-3. Travel Costs&Costs of Stay'!O:O,'2-3. Travel Costs&Costs of Stay'!B:B,B6,'2-3. Travel Costs&Costs of Stay'!R:R,\"<>Error\")","v":0},{"$f":"SUMIFS('2-3. Travel Costs&Costs of Stay'!P:P,'2-3. Travel Costs&Costs of Stay'!B:B,B6,'2-3. Travel Costs&Costs of Stay'!R:R,\"<>Error\")","v":0},{"$f":"SUMIFS('4. Equipment Costs'!N:N,'4. Equipment Costs'!B:B,B6,'4. Equipment Costs'!O:O,\"<>Error\")","v":0},{"$f":"SUMIFS('5. Subcontracting Costs'!N:N,'5. Subcontracting Costs'!B:B,B6,'5. Subcontracting Costs'!O:O,\"<>Error\")","v":0},null,{"$f":"SUM(C6:G6)","v":0}]
[null,{"$f":"Rates!J5","v":"Quality Plan"},{"$f":"SUMIFS('1. Staff costs'!N:N,'1. Staff costs'!B:B,B7,'1. Staff costs'!O:O,\"<>Error\")","v":0},{"$f":"SUMIFS('2-3. Travel Costs&Costs of Stay'!O:O,'2-3. Travel Costs&Costs of Stay'!B:B,B7,'2-3. Travel Costs&Costs of Stay'!R:R,\"<>Error\")","v":0},{"$f":"SUMIFS('2-3. Travel Costs&Costs of Stay'!P:P,'2-3. Travel Costs&Costs of Stay'!B:B,B7,'2-3. Travel Costs&Costs of Stay'!R:R,\"<>Error\")","v":0},{"$f":"SUMIFS('4. Equipment Costs'!N:N,'4. Equipment Costs'!B:B,B7,'4. Equipment Costs'!O:O,\"<>Error\")","v":0},{"$f":"SUMIFS('5. Subcontracting Costs'!N:N,'5. Subcontracting Costs'!B:B,B7,'5. Subcontracting Costs'!O:O,\"<>Error\")","v":0},null,0]
[null,{"$f":"Rates!J6","v":"Dissemination & Exploitation"},{"$f":"SUMIFS('1. Staff costs'!N:N,'1. Staff costs'!B:B,B8,'1. Staff costs'!O:O,\"<>Error\")","v":0},{"$f":"SUMIFS('2-3. Travel Costs&Costs of Stay'!O:O,'2-3. Travel Costs&Costs of Stay'!B:B,B8,'2-3. Travel Costs&Costs of Stay'!R:R,\"<>Error\")","v":0},{"$f":"SUMIFS('2-3. Travel Costs&Costs of Stay'!P:P,'2-3. Travel Costs&Costs of Stay'!B:B,B8,'2-3. Travel Costs&Costs of Stay'!R:R,\"<>Error\")","v":0},{"$f":"SUMIFS('4. Equipment Costs'!N:N,'4. Equipment Costs'!B:B,B8,'4. Equipment Costs'!O:O,\"<>Error\")","v":0},{"$f":"SUMIFS('5. Subcontracting Costs'!N:N,'5. Subcontracting Costs'!B:B,B8,'5. Subcontracting Costs'!O:O,\"<>Error\")","v":0},null,0]
{"$rows_left_out":74}
{"sheet":"Breakdown Staff & Travel Costs","index":9,"n_rows":123,"n_cols":12,"rows_kept":123,"cut":false,"hidden":false,"merged":[[1,1,1,11],[3,8,3,9],[3,6,3,7],[3,4,3,5],[3,2,3,3],[3,1,4,1],[3,11,4,11],[3,10,4,10],[74,2,74,3],[65,11,66,11],[65,10,66,10],[63,1,63,11],[65,6,65,9],[66,6,66,7],[66,8,66,9],[75,2,75,3],[76,2,76,3],[67,2,67,3],[68,2,68,3],[69,2,69,3],[70,2,70,3],[71,2,71,3],[65,1,66,1],[65,2,65,5],[66,2,66,3],[66,4,66,5],[69,4,69,5],[70,4,70,5],[71,4,71,5],[72,4,72,5],[73,4,73,5],[67,4,67,5],[68,4,68,5],[72,2,72,3],[73,2,73,3],[82,2,82,3],[83,2,83,3],[84,2,84,3],[85,2,85,3],[86,2,86,3],[77,2,77,3],[78,2,78,3],[79,2,79,3],[80,2,80,3],[81,2,81,3],[92,2,92,3],[93,2,93,3],[94,2,94,3],[95,2,95,3],[96,2,96,3],[87,2,87,3],[88,2,88,3],[89,2,89,3],[90,2,90,3],[91,2,91,3],[102,2,102,3],[103,2,103,3],[104,2,104,3],[105,2,105,3],[106,2,106,3],[97,2,97,3],[98,2,98,3],[99,2,99,3],[100,2,100,3],[101,2,101,3],[112,2,112,3],[113,2,113,3],[114,2,114,3],[115,2,115,3],[116,2,116,3],[107,2,107,3],[108,2,108,3],[109,2,109,3],[110,2,110,3],[111,2,111,3],[79,4,79,5],[80,4,80,5],[81,4,81,5],[82,4,82,5],[83,4,83,5],[74,4,74,5],[75,4,75,5],[76,4,76,5],[77,4,77,5],[78,4,78,5],[89,4,89,5],[90,4,90,5],[91,4,91,5],[92,4,92,5],[93,4,93,5],[84,4,84,5],[85,4,85,5],[86,4,86,5],[87,4,87,5],[88,4,88,5],[99,4,99,5],[100,4,100,5],[101,4,101,5],[102,4,102,5],[103,4,103,5],[94,4,94,5],[95,4,95,5],[96,4,96,5],[97,4,97,5],[98,4,98,5],[109,4,109,5],[110,4,110,5],[111,4,111,5],[112,4,112,5],[113,4,113,5],[104,4,104,5],[105,4,105,5],[106,4,106,5],[107,4,107,5],[108,4,108,5],[80,6,80,7],[81,6,81,7],[82,6,82,7],[83,6,83,7],[84,6,84,7],[119,4,119,5],[120,4,120,5],[121,4,121,5],[67,6,67,7],[68,6,68,7],[69,6,69,7],[70,6,70,7],[71,6,71,7],[72,6,72,7],[73,6,73,7],[74,6,74,7],[75,6,75,7],[76,6,76,7],[77,6,77,7],[78,6,78,7],[79,6,79,7],[114,4,114,5],[115,4,115,5],[116,4,116,5],[90,6,90,7],[91,6,91,7],[92,6,92,7],[93,6,93,7],[94,6,94,7],[85,6,85,7],[86,6,86,7],[87,6,87,7],[88,6,88,7],[89,6,89,7],[100,6,100,7],[101,6,101,7],[102,6,102,7],[103,6,103,7],[104,6,104,7],[95,6,95,7],[96,6,96,7],[97,6,97,7],[98,6,98,7],[99,6,99,7],[110,6,110,7],[111,6,111,7],[112,6,112,7],[113,6,113,7],[114,6,114,7],[105,6,105,7],[106,6,106,7],[107,6,107,7],[108,6,108,7],[109,6,109,7],[81,8,81,9],[82,8,82,9],[83,8,83,9],[84,8,84,9],[85,8,85,9],[120,6,120,7],[121,6,121,7],[67,8,67,9],[68,8,68,9],[69,8,69,9],[70,8,70,9],[71,8,71,9],[72,8,72,9],[73,8,73,9],[74,8,74,9],[75,8,75,9],[76,8,76,9],[77,8,77,9],[78,8,78,9],[79,8,79,9],[80,8,80,9],[115,6,115,7],[116,6,116,7],[117,6,117,7],[91,8,91,9],[92,8,92,9],[93,8,93,9],[94,8,94,9],[95,8,95,9],[86,8,86,9],[87,8,87,9],[88,8,88,9],[89,8,89,9],[90,8,90,9],[101,8,101,9],[102,8,102,9],[103,8,103,9],[104,8,104,9],[105,8,105,9],[96,8,96,9],[97,8,97,9],[98,8,98,9],[99,8,99,9],[100,8,100,9],[111,8,111,9],[112,8,112,9],[113,8,113,9],[114,8,114,9],[115,8,115,9],[106,8,106,9],[107,8,107,9],[108,8,108,9],[109,8,109,9],[110,8,110,9],[122,8,122,9],[122,6,122,7],[122,4,122,5],[122,2,122,3],[121,8,121,9],[116,8,116,9],[117,8,117,9],[118,8,118,9],[119,8,119,9],[120,8,120,9],[118,6,118,7],[119,6,119,7],[117,4,117,5],[118,4,118,5],[117,2,117,3],[118,2,118,3],[119,2,119,3],[120,2,120,3],[121,2,121,3]]}
[]
[null,"Budget Breakdown by Partner / Category of Staff"]
[]
[null,"Partner\nN°","Manager",null,"Teacher/Trainer/Researcher",null,"Technical Staff",null,"Administrative Staff",null,"Total\n(in EUR)","Total\nDays"]
[null,null,"Total\n(in EUR)","Number of\nDays","Total\n(in EUR)","Number of\nDays","Total\n(in EUR)","Number of\nDays","Total\n(in EUR)","Number of\nDays"]
[null,"P1",{"$f":"SUMIFS('1. Staff costs'!N:N,'1. Staff costs'!C:C,B6,'1. Staff costs'!H:H,$C$4,'1. Staff costs'!O:O,\"<>Error\")","v":0},{"$f":"SUMIFS('1. Staff costs'!P:P,'1. Staff costs'!C:C,B6,'1. Staff costs'!H:H,$C$4,'1. Staff costs'!O:O,\"<>Error\")","v":0},{"$f":"SUMIFS('1. Staff costs'!N:N,'1. Staff costs'!C:C,B6,'1. Staff costs'!H:H,$E$4,'1. Staff costs'!O:O,\"<>Error\")","v":0},{"$f":"SUMIFS('1. Staff costs'!P:P,'1. Staff costs'!C:C,B6,'1. Staff costs'!H:H,$E$4,'1. Staff costs'!O:O,\"<>Error\")","v":0},{"$f":"SUMIFS('1. Staff costs'!N:N,'1. Staff costs'!C:C,B6,'1. Staff costs'!H:H,$G$4,'1. Staff costs'!O:O,\"<>Error\")","v":0},{"$f":"SUMIFS('1. Staff costs'!P:P,'1. Staff costs'!C:C,B6,'1. Staff costs'!H:H,$G$4,'1. Staff costs'!O:O,\"<>Error\")","v":0},{"$f":"SUMIFS('1. Staff costs'!N:N,'1. Staff costs'!C:C,B6,'1. Staff costs'!H:H,$I$4,'1. Staff costs'!O:O,\"<>Error\")","v":0},{"$f":"SUMIFS('1. Staff costs'!P:P,'1. Staff costs'!C:C,B6,'1. Staff costs'!H:H,$I$4,'1. Staff costs'!O:O,\"<>Error\")","v":0},{"$f":"C6+E6+G6+I6","v":0},{"$f":"D6+F6+H6+J6","v":0}]
[null,"P2",{"$f":"SUMIFS('1. Staff costs'!N:N,'1. Staff costs'!C:C,B7,'1. Staff costs'!H:H,$C$4,'1. Staff costs'!O:O,\"<>Error\")","v":0},{"$f":"SUMIFS('1. Staff costs'!P:P,'1. Staff costs'!C:C,B7,'1. Staff costs'!H:H,$C$4,'1. Staff costs'!O:O,\"<>Error\")","v":0},{"$f":"SUMIFS('1. Staff costs'!N:N,'1. Staff costs'!C:C,B7,'1. Staff costs'!H:H,$E$4,'1. Staff costs'!O:O,\"<>Error\")","v":0},{"$f":"SUMIFS('1. Staff costs'!P:P,'1. Staff costs'!C:C,B7,'1. Staff costs'!H:H,$E$4,'1. Staff costs'!O:O,\"<>Error\")","v":0},{"$f":"SUMIFS('1. Staff costs'!N:N,'1. Staff costs'!C:C,B7,'1. Staff costs'!H:H,$G$4,'1. Staff costs'!O:O,\"<>Error\")","v":0},{"$f":"SUMIFS('1. Staff costs'!P:P,'1. Staff costs'!C:C,B7,'1. Staff costs'!H:H,$G$4,'1. Staff costs'!O:O,\"<>Error\")","v":0},{"$f":"SUMIFS('1. Staff costs'!N:N,'1. Staff costs'!C:C,B7,'1. Staff costs'!H:H,$I$4,'1. Staff costs'!O:O,\"<>Error\")","v":0},{"$f":"SUMIFS('1. Staff costs'!P:P,'1. Staff costs'!C:C,B7,'1. Staff costs'!H:H,$I$4,'1. Staff costs'!O:O,\"<>Error\")","v":0},{"$f":"C7+E7+G7+I7","v":0},{"$f":"D7+F7+H7+J7","v":0}]
[null,"P3",{"$f":"SUMIFS('1. Staff costs'!N:N,'1. Staff costs'!C:C,B8,'1. Staff costs'!H:H,$C$4,'1. Staff costs'!O:O,\"<>Error\")","v":0},{"$f":"SUMIFS('1. Staff costs'!P:P,'1. Staff costs'!C:C,B8,'1. Staff costs'!H:H,$C$4,'1. Staff costs'!O:O,\"<>Error\")","v":0},{"$f":"SUMIFS('1. Staff costs'!N:N,'1. Staff costs'!C:C,B8,'1. Staff costs'!H:H,$E$4,'1. Staff costs'!O:O,\"<>Error\")","v":0},{"$f":"SUMIFS('1. Staff costs'!P:P,'1. Staff costs'!C:C,B8,'1. Staff costs'!H:H,$E$4,'1. Staff costs'!O:O,\"<>Error\")","v":0},{"$f":"SUMIFS('1. Staff costs'!N:N,'1. Staff costs'!C:C,B8,'1. Staff costs'!H:H,$G$4,'1. Staff costs'!O:O,\"<>Error\")","v":0},{"$f":"SUMIFS('1. Staff costs'!P:P,'1. Staff costs'!C:C,B8,'1. Staff costs'!H:H,$G$4,'1. Staff costs'!O:O,\"<>Error\")","v":0},{"$f":"SUMIFS('1. Staff costs'!N:N,'1. Staff costs'!C:C,B8,'1. Staff costs'!H:H,$I$4,'1. Staff costs'!O:O,\"<>Error\")","v":0},{"$f":"SUMIFS('1. Staff costs'!P:P,'1. Staff costs'!C:C,B8,'1. Staff costs'!H:H,$I$4,'1. Staff costs'!O:O,\"<>Error\")","v":0},0,0]
{"$rows_left_out":116}
{"sheet":"Rates","index":10,"n_rows":181,"n_cols":10,"rows_kept":181,"cut":false,"hidden":true,"merged":[]}
[]
[null,"Rates 2016","Country","PR/PA","Manager","Teacher/Trainer/Researcher","Technical Staff","Administrative Staff",null,"Work Package"]
[null,1,"Austria","Programme Countries",294,241,190,157,null,"Preparation"]
[null,2,"Belgium","Programme Countries",280,214,162,131,null,"Development"]
[null,3,"Bulgaria","Programme Countries",88,74,55,39,null,"Quality Plan"]
[null,4,"Croatia","Programme Countries",88,74,55,39,null,"Dissemination & Exploitation"]
[null,5,"Cyprus","Programme Countries",164,137,102,78,null,"Management"]
[null,6,"Czech Republic","Programme Countries",164,137,102,78]
{"$rows_left_out":173}